Reaction Details
TargetPhosphatidylinositol 4-phosphate 3-kinase C2 domain-containing subunit beta
LigandBDBM315554
Substrate/Competitorn/a
Meas. Tech.Inhibition Assay
IC50>500±n/a nM
Citation Ren, PLiu, YLi, LChan, KWilson, TE Kinase inhibitors and methods of use US Patent US9828378 Publication Date 11/28/2017
 
Phosphatidylinositol 4-phosphate 3-kinase C2 domain-containing subunit beta
Name:Phosphatidylinositol 4-phosphate 3-kinase C2 domain-containing subunit beta
Type:Enzyme
Mol. Mass.:184784.86
Organism:Homo sapiens (Human)
Description:O00750
Residue:1634
BDBM315554
NameBDBM315554
Synonyms:US10172858, Table 2.51 | US9828378, # 51
TypeSmall organic molecule
Emp. Form.C18H17ClN6O
Mol. Mass.368.82
SMILESNc1ncnc2n(nc(-c3cc4cccc(Cl)c4[nH]3)c12)C1CCOCC1