Reaction Details
TargetPhosphatidylinositol 4-phosphate 3-kinase C2 domain-containing subunit beta
LigandBDBM315566
Substrate/Competitorn/a
Meas. Tech.Inhibition Assay
IC50>500±n/a nM
Citation Ren, PLiu, YLi, LChan, KWilson, TE Kinase inhibitors and methods of use US Patent US9828378 Publication Date 11/28/2017
 
Phosphatidylinositol 4-phosphate 3-kinase C2 domain-containing subunit beta
Name:Phosphatidylinositol 4-phosphate 3-kinase C2 domain-containing subunit beta
Type:Enzyme
Mol. Mass.:184784.86
Organism:Homo sapiens (Human)
Description:O00750
Residue:1634
BDBM315566
NameBDBM315566
Synonyms:US10172858, Table 2.63 | US9828378, # 63
TypeSmall organic molecule
Emp. Form.C19H20N6O2
Mol. Mass.364.4011
SMILESCOc1cccc2cc([nH]c12)-c1nn(C2CCOCC2)c2ncnc(N)c12