Reaction Details
TargetBromodomain and PHD finger-containing protein 3
LigandBDBM50157570
Substrate/Competitorn/a
Meas. Tech.Alpha Screen competitive assay
pH7.4±n/a
Temperature298.15±n/a K
IC50 1010±n/a nM
Commentsextracted
Citation Meier, JCTallant, CFedorov, OWitwicka, HHwang, SYvan Stiphout, RGLambert, JPRogers, CYapp, CGerstenberger, BSFedele, VSavitsky, PHeidenreich, DDaniels, DLOwen, DRFish, PVIgoe, NMBayle, EDHaendler, BOppermann, UCTBuffa, FBrennan, PEMüller, SGingras, ACOdgren, PRBirnbaum, MJKnapp, S Selective Targeting of Bromodomains of the Bromodomain-PHD Fingers Family Impairs Osteoclast Differentiation. ACS Chem Biol12:2619-2630 (2017) 
 
Bromodomain and PHD finger-containing protein 3
Name:Bromodomain and PHD finger-containing protein 3
Type:PROTEIN
Mol. Mass.:135743.95
Organism:Homo sapiens (Human)
Description:ChEMBL_108004
Residue:1205
BDBM50157570
NameBDBM50157570
Synonyms:4-cyano-N-(1,3-dimethyl-2-oxoquinolin-6-yl)-2-methoxybenzenesulfonamide D0O6XT NI 57 US11773085, Compound B26
TypeSmall organic molecule
Emp. Form.C19H17N3O4S
Mol. Mass.383.421
SMILESCOc1cc(ccc1S(=O)(=O)Nc1ccc2n(C)c(=O)c(C)cc2c1)C#N