Reaction Details
TargetHistone deacetylase 1
LigandBDBM19158
Substrate/CompetitorBDBM19150
Meas. Tech.HDAC Enzyme Activity Assay
pH8±n/a
Temperature310.15±n/a K
IC50 61.9±n/a nM
Citation Bhuiyan, MPKato, TOkauchi, TNishino, NMaeda, SNishino, TGYoshida, M Chlamydocin analogs bearing carbonyl group as possible ligand toward zinc atom in histone deacetylases. Bioorg Med Chem14:3438-46 (2006) 
 
Histone deacetylase 1
Name:Histone deacetylase 1
Type:Enzyme
Mol. Mass.:55090.27
Organism:Homo sapiens (Human)
Description:Q13547
Residue:482
BDBM19158
BDBM19150
NameBDBM19158
Synonyms:(3S,9S,14aR)-9-benzyl-3-(7-bromo-6-oxoheptyl)-6,6-dimethyl-tetradecahydropyrrolo[1,2-a][,,,]cyclododecane-1,4,7,10-tetrone | chlamydocin-bromomethylketone analog, 4
TypeSmall organic molecule
Emp. Form.C27H37BrN4O5
Mol. Mass.577.51
SMILESCC1(C)NC(=O)[C@H](CCCCCC(=O)CBr)NC(=O)[C@H]2CCCN2C(=O)[C@H](Cc2ccccc2)NC1=O