Reaction Details
TargetHistone deacetylase 4
LigandBDBM19156
Substrate/CompetitorBDBM19150
Meas. Tech.HDAC Enzyme Activity Assay
pH8±n/a
Temperature310.15±n/a K
IC50>100000±n/a nM
Citation Bhuiyan, MPKato, TOkauchi, TNishino, NMaeda, SNishino, TGYoshida, M Chlamydocin analogs bearing carbonyl group as possible ligand toward zinc atom in histone deacetylases. Bioorg Med Chem14:3438-46 (2006) 
 
Histone deacetylase 4
Name:Histone deacetylase 4
Type:Enzyme
Mol. Mass.:119049.39
Organism:Homo sapiens (Human)
Description:P56524
Residue:1084
BDBM19156
BDBM19150
NameBDBM19156
Synonyms:(3S,9S,14aR)-9-benzyl-3-(hept-6-en-1-yl)-6,6-dimethyl-tetradecahydropyrrolo[1,2-a][,,,]cyclododecane-1,4,7,10-tetrone | cyclo(-L-Ae9-Aib-L-Phe-D-Pro-), 1
TypeSmall organic molecule
Emp. Form.C27H38N4O4
Mol. Mass.482.615
SMILESCC1(C)NC(=O)[C@H](CCCCCC=C)NC(=O)[C@H]2CCCN2C(=O)[C@H](Cc2ccccc2)NC1=O