Reaction Details
TargetHistone deacetylase 6
LigandBDBM19161
Substrate/CompetitorBDBM19150
Meas. Tech.HDAC Enzyme Activity Assay
pH8±n/a
Temperature310.15±n/a K
IC50 14100±n/a nM
Citation Bhuiyan, MPKato, TOkauchi, TNishino, NMaeda, SNishino, TGYoshida, M Chlamydocin analogs bearing carbonyl group as possible ligand toward zinc atom in histone deacetylases. Bioorg Med Chem14:3438-46 (2006) 
 
Histone deacetylase 6
Name:Histone deacetylase 6
Type:PROTEIN
Mol. Mass.:125762.28
Organism:Mus musculus
Description:ChEMBL_1460074
Residue:1149
BDBM19161
BDBM19150
NameBDBM19161
Synonyms:6-[(3S,9S,14aR)-9-benzyl-6,6-dimethyl-1,4,7,10-tetraoxo-tetradecahydropyrrolo[1,2-a][,,,]cyclododecan-3-yl]hexanal | chlamydocin-aldehyde analog, 7
TypeSmall organic molecule
Emp. Form.C26H36N4O5
Mol. Mass.484.5878
SMILESCC1(C)NC(=O)[C@H](CCCCCC=O)NC(=O)[C@H]2CCCN2C(=O)[C@H](Cc2ccccc2)NC1=O