Reaction Details
TargetGlucocorticoid receptor
LigandBDBM19207
Substrate/CompetitorBDBM18207
Meas. Tech.GR Binding Assay and Human IL-6 Assay
pH7.5±n/a
Temperature277.15±n/a K
IC50 1.1±n/a nM
EC50 4.4±n/a nM
Citation Ali, AThompson, CFBalkovec, JMGraham, DWHammond, MLQuraishi, NTata, JREinstein, MGe, LHarris, GKelly, TMMazur, PPandit, SSantoro, JSitlani, AWang, CWilliamson, JMiller, DKThompson, CMZaller, DMForrest, MJCarballo-Jane, ELuell, S Novel N-arylpyrazolo[3,2-c]-based ligands for the glucocorticoid receptor: receptor binding and in vivo activity. J Med Chem47:2441-52 (2004) 
 
Glucocorticoid receptor
Name:Glucocorticoid receptor
Type:Enzyme
Mol. Mass.:85656.87
Organism:Homo sapiens (Human)
Description:P04150
Residue:777
BDBM19207
BDBM18207
NameBDBM19207
Synonyms:(1S)-1-[(4aR,5S)-1-(4-fluorophenyl)-4a-methyl-1H,4H,4aH,5H,6H,7H,8H-cyclohexa[f]indazol-5-yl]pent-4-en-1-ol | N-Arylpyrazolo[3,2-c]-Based Ligand, 31
TypeSmall organic molecule
Emp. Form.C23H27FN2O
Mol. Mass.366.4717
SMILES[H][C@@]1(CCCC2=Cc3c(C[C@]12C)cnn3-c1ccc(F)cc1)[C@@H](O)CCC=C