Reaction Details
TargetEstrogen receptor
LigandBDBM361420
Substrate/Competitorn/a
Meas. Tech.MCF-7 ER Down-Regulation Assay
IC50 0.059±n/a nM
Citation Nissink, JWScott, JSMoss, TAHughes, SJBarlaam, BCYang, B Chemical compounds US Patent US10221173 Publication Date 3/5/2019
 
Estrogen receptor
Name:Estrogen receptor
Type:Protein
Mol. Mass.:66230.44
Organism:Homo sapiens (Human)
Description:P03372
Residue:595
BDBM361420
NameBDBM361420
Synonyms:Preparation of 3-fluoro-N-(2-((5-methoxy-4-((1R,3R)-3-methyl-2-(2,2,2-trifluoroethyl)-2,3,4,9-tetrahydro-1H-pyrido[3,4-b]indol-1-yl)pyridin-2-yl)oxy)ethyl)propan-1-amine US10590132, Example 12 | US11046689, Example 12
TypeSmall organic molecule
Emp. Form.C25H30F4N4O2
Mol. Mass.494.5249
SMILESCOc1cnc(OCCNCCCF)cc1[C@H]1N(CC(F)(F)F)[C@H](C)Cc2c1[nH]c1ccccc21