Reaction Details
TargetEstrogen receptor
LigandBDBM361430
Substrate/Competitorn/a
Meas. Tech.MCF-7 ER Down-Regulation Assay
IC50 0.120±n/a nM
Citation Nissink, JWScott, JSMoss, TAHughes, SJBarlaam, BCYang, B Chemical compounds US Patent US10221173 Publication Date 3/5/2019
 
Estrogen receptor
Name:Estrogen receptor
Type:Protein
Mol. Mass.:66230.44
Organism:Homo sapiens (Human)
Description:P03372
Residue:595
BDBM361430
NameBDBM361430
Synonyms:N-(2-(4- chloro-3- ((1R,3R)-3- methyl-2- (2,2,2- trifluoroethyl)- 2,3,4,9- tetrahydro-1H- pyrido[3,4- b]indol-1- yl)phenoxy) ethyl)-3- fluoropropan- 1-amine US10590132, Example 22 | US11046689, Example 22
TypeSmall organic molecule
Emp. Form.C25H28ClF4N3O
Mol. Mass.497.956
SMILESC[C@@H]1Cc2c([nH]c3ccccc23)[C@H](N1CC(F)(F)F)c1cc(OCCNCCCF)ccc1Cl