Reaction Details
TargetEstrogen receptor
LigandBDBM361476
Substrate/Competitorn/a
Meas. Tech.MCF-7 ER Down-Regulation Assay
IC50 0.095±n/a nM
Citation Nissink, JWScott, JSMoss, TAHughes, SJBarlaam, BCYang, B Chemical compounds US Patent US10221173 Publication Date 3/5/2019
 
Estrogen receptor
Name:Estrogen receptor
Type:Protein
Mol. Mass.:66230.44
Organism:Homo sapiens (Human)
Description:P03372
Residue:595
BDBM361476
NameBDBM361476
Synonyms:3-((1R,3R)-1- (2- (difluoromethyl)- 3-(2-((3- fluoropropyl) amino)ethoxy) phenyl)-3- methyl- 1,3,4,9- tetrahydro-2H- pyrido[3,4- b]indol-2-yl)- 2,2- difluoropropan-1- ol US10590132, Example 68 | US11046689, Example 68
TypeSmall organic molecule
Emp. Form.C27H32F5N3O2
Mol. Mass.525.5539
SMILESC[C@@H]1Cc2c([nH]c3ccccc23)[C@H](N1CC(F)(F)CO)c1cccc(OCCNCCCF)c1C(F)F