Reaction Details
TargetMineralocorticoid receptor
LigandBDBM18627
Substrate/CompetitorBDBM19214
Meas. Tech.Competitive Receptor Binding Assay
pH8±n/a
Temperature277.15±n/a K
IC50 6000±n/a nM
Citation Link, JTSorensen, BPatel, JGrynfarb, MGoos-Nilsson, AWang, JFung, SWilcox, DZinker, BNguyen, PHickman, BSchmidt, JMSwanson, STian, ZReisch, TJRotert, GDu, JLane, Bvon Geldern, TWJacobson, PB Antidiabetic activity of passive nonsteroidal glucocorticoid receptor modulators. J Med Chem48:5295-304 (2005) 
 
Mineralocorticoid receptor
Name:Mineralocorticoid receptor
Type:Enzyme
Mol. Mass.:107076.42
Organism:Homo sapiens (Human)
Description:P08235
Residue:984
BDBM18627
BDBM19214
NameBDBM18627
Synonyms:(10S,11S,14S,15S,17R)-17-[4-(dimethylamino)phenyl]-14-hydroxy-15-methyl-14-(prop-1-yn-1-yl)tetracyclo[8.7.0.0^{2,7}.0^{11,15}]heptadeca-1,6-dien-5-one Mifepristone RU486 (tetramethyl-rhodamine conjugated)
TypeSmall organic molecule
Emp. Form.C29H35NO2
Mol. Mass.429.5937
SMILES[H][C@@]12CC[C@@](O)(C#CC)[C@@]1(C)C[C@@H](C1=C3CCC(=O)C=C3CC[C@@]21[H])c1ccc(cc1)N(C)C