Reaction Details
TargetAndrogen receptor
LigandBDBM19249
Substrate/CompetitorBDBM26258
Meas. Tech.Competitive Radioligand Displacement Assay
pH7.4±n/a
Temperature277.15±n/a K
Ki 41.2±5.9 nM
CommentsIC50=13800 +/- 400 for inhibiting growth of prostate cancer cell line, LNCaP.
Citation Hwang, DJYang, JXu, HRakov, IMMohler, MLDalton, JTMiller, DD Arylisothiocyanato selective androgen receptor modulators (SARMs) for prostate cancer. Bioorg Med Chem14:6525-38 (2006) 
 
Androgen receptor
Name:Androgen receptor
Type:Enzyme
Mol. Mass.:98219.08
Organism:Rattus norvegicus (Rat)
Description:P15207
Residue:902
BDBM19249
BDBM26258
NameBDBM19249
Synonyms:(2S)-2-hydroxy-3-[(4-isothiocyanatophenyl)(methyl)amino]-2-methyl-N-[4-nitro-3-(trifluoromethyl)phenyl]propanamide | arylisothiocyanato derivative, S-33
TypeSmall organic molecule
Emp. Form.C19H17F3N4O4S
Mol. Mass.454.423
SMILESCN(C[C@](C)(O)C(=O)Nc1ccc(c(c1)C(F)(F)F)[N+]([O-])=O)c1ccc(cc1)N=C=S