Reaction Details
TargetAndrogen receptor
LigandBDBM19250
Substrate/CompetitorBDBM26258
Meas. Tech.Competitive Radioligand Displacement Assay
pH7.4±n/a
Temperature277.15±n/a K
Ki 54.8±3.0 nM
Citation Hwang, DJYang, JXu, HRakov, IMMohler, MLDalton, JTMiller, DD Arylisothiocyanato selective androgen receptor modulators (SARMs) for prostate cancer. Bioorg Med Chem14:6525-38 (2006) 
 
Androgen receptor
Name:Androgen receptor
Type:Enzyme
Mol. Mass.:98219.08
Organism:Rattus norvegicus (Rat)
Description:P15207
Residue:902
BDBM19250
BDBM26258
NameBDBM19250
Synonyms:(2R)-2-hydroxy-3-[(4-isothiocyanatophenyl)sulfanyl]-2-methyl-N-[4-nitro-3-(trifluoromethyl)phenyl]propanamide | arylisothiocyanato derivative, R-34
TypeSmall organic molecule
Emp. Form.C18H14F3N3O4S2
Mol. Mass.457.447
SMILESC[C@](O)(CSc1ccc(cc1)N=C=S)C(=O)Nc1ccc(c(c1)C(F)(F)F)[N+]([O-])=O