Reaction Details
TargetInosine-5'-monophosphate dehydrogenase 2
LigandBDBM19283
Substrate/CompetitorBDBM19254
Meas. Tech.IMPDH2 Enzyme Inhibition and Human T-Lymphoblast (CEM) Proliferation Inhibition Assays
pH8±n/a
Temperature298.15±n/a K
IC50 10±4.6 nM
EC50 660±110 nM
Citation Watterson, SHChen, PZhao, YGu, HHDhar, TGXiao, ZBallentine, SKShen, ZFleener, CARouleau, KAObermeier, MYang, ZMcIntyre, KWShuster, DJWitmer, MDambach, DChao, SMathur, AChen, BCBarrish, JCRobl, JATownsend, RIwanowicz, EJ Acridone-based inhibitors of inosine 5'-monophosphate dehydrogenase: discovery and SAR leading to the identification of N-(2-(6-(4-ethylpiperazin-1-yl)pyridin-3-yl)propan-2-yl)-2- fluoro-9-oxo-9,10-dihydroacridine-3-carboxamide (BMS-566419). J Med Chem50:3730-42 (2007) 
 
Inosine-5'-monophosphate dehydrogenase 2
Name:Inosine-5'-monophosphate dehydrogenase 2
Type:Enzyme
Mol. Mass.:55806.87
Organism:Homo sapiens (Human)
Description:Recombinant IMPDH2 expressed in E. coli.
Residue:514
BDBM19283
BDBM19254
NameBDBM19283
Synonyms:Acridone-Based Inhibitor, 4g | N-{2-[4-(dimethylsulfamoyl)phenyl]propan-2-yl}-2-fluoro-9-oxo-9,10-dihydroacridine-3-carboxamide
TypeSmall organic molecule
Emp. Form.C25H24FN3O4S
Mol. Mass.481.539
SMILESCN(C)S(=O)(=O)c1ccc(cc1)C(C)(C)NC(=O)c1cc2[nH]c3ccccc3c(=O)c2cc1F