Reaction Details
TargetInosine-5'-monophosphate dehydrogenase 2
LigandBDBM19292
Substrate/CompetitorBDBM19254
Meas. Tech.IMPDH2 Enzyme Inhibition and Human T-Lymphoblast (CEM) Proliferation Inhibition Assays
pH8±n/a
Temperature298.15±n/a K
IC50 11±1.2 nM
EC50 870±40 nM
Citation Watterson, SHChen, PZhao, YGu, HHDhar, TGXiao, ZBallentine, SKShen, ZFleener, CARouleau, KAObermeier, MYang, ZMcIntyre, KWShuster, DJWitmer, MDambach, DChao, SMathur, AChen, BCBarrish, JCRobl, JATownsend, RIwanowicz, EJ Acridone-based inhibitors of inosine 5'-monophosphate dehydrogenase: discovery and SAR leading to the identification of N-(2-(6-(4-ethylpiperazin-1-yl)pyridin-3-yl)propan-2-yl)-2- fluoro-9-oxo-9,10-dihydroacridine-3-carboxamide (BMS-566419). J Med Chem50:3730-42 (2007) 
 
Inosine-5'-monophosphate dehydrogenase 2
Name:Inosine-5'-monophosphate dehydrogenase 2
Type:Enzyme
Mol. Mass.:55806.87
Organism:Homo sapiens (Human)
Description:Recombinant IMPDH2 expressed in E. coli.
Residue:514
BDBM19292
BDBM19254
NameBDBM19292
Synonyms:2-fluoro-N-{2-[5-methyl-6-(morpholin-4-yl)pyridin-3-yl]propan-2-yl}-9-oxo-9,10-dihydroacridine-3-carboxamide | Acridone-Based Inhibitor, 4p
TypeSmall organic molecule
Emp. Form.C27H27FN4O3
Mol. Mass.474.5267
SMILESCc1cc(cnc1N1CCOCC1)C(C)(C)NC(=O)c1cc2[nH]c3ccccc3c(=O)c2cc1F