Reaction Details
TargetHistone deacetylase 4 [648-1032]
LigandBDBM243187
Substrate/Competitorn/a
Meas. Tech.HDAC4 Biochemical Assay
IC50 12.0±n/a nM
Citation Maillard, MCBreccia, PDominguez, CHaughan, AFVan de Poël, AStott, AJLuckhurst, CASaville-Stones, EAWishart, GWall, MJarvis, RE Histone deacetylase inhibitors and compositions and methods of use thereof US Patent US10053434 Publication Date 8/21/2018
 
Histone deacetylase 4 [648-1032]
Name:Histone deacetylase 4 [648-1032]
Type:Enzyme
Mol. Mass.:41490.90
Organism:Homo sapiens (Human)
Description:P56524[648-1032]
Residue:385
BDBM243187
NameBDBM243187
Synonyms:2-((R)-2-(4-(5-(Trifluoromethyl)-1,2,4- oxadiazol-3- yl)benzamido)propyl)octahydrocyclopenta [c]pyrrol-2-ium formate | US10053434, 17
TypeSmall organic molecule
Emp. Form.C20H24F3N4O2
Mol. Mass.409.4248
SMILESC[C@H](C[NH+]1CC2CCCC2C1)NC(=O)c1ccc(cc1)-c1noc(n1)C(F)(F)F