Reaction Details
TargetHistone deacetylase 1
LigandBDBM19416
Substrate/CompetitorBDBM19411
Meas. Tech.HDAC Enzyme Activity Assay
pH8±n/a
Temperature310.15±n/a K
IC50 50±n/a nM
Citation Moradei, OMMallais, TCFrechette, SPaquin, ITessier, PELeit, SMFournel, MBonfils, CTrachy-Bourget, MCLiu, JYan, TPLu, AHRahil, JWang, JLefebvre, SLi, ZVaisburg, AFBesterman, JM Novel aminophenyl benzamide-type histone deacetylase inhibitors with enhanced potency and selectivity. J Med Chem50:5543-6 (2007) 
 
Histone deacetylase 1
Name:Histone deacetylase 1
Type:Enzyme
Mol. Mass.:55090.27
Organism:Homo sapiens (Human)
Description:Q13547
Residue:482
BDBM19416
BDBM19411
NameBDBM19416
Synonyms:N-[2-amino-5-(thiophen-3-yl)phenyl]-4-{[(3,4-dimethoxyphenyl)amino]methyl}benzamide | benzamide-type inhibitor, 12
TypeSmall organic molecule
Emp. Form.C26H25N3O3S
Mol. Mass.459.56
SMILESCOc1ccc(NCc2ccc(cc2)C(=O)Nc2cc(ccc2N)-c2ccsc2)cc1OC