Reaction Details
TargetHistone deacetylase 1
LigandBDBM19421
Substrate/CompetitorBDBM19411
Meas. Tech.HDAC Enzyme Activity Assay
pH8±n/a
Temperature310.15±n/a K
IC50 40±n/a nM
Citation Moradei, OMMallais, TCFrechette, SPaquin, ITessier, PELeit, SMFournel, MBonfils, CTrachy-Bourget, MCLiu, JYan, TPLu, AHRahil, JWang, JLefebvre, SLi, ZVaisburg, AFBesterman, JM Novel aminophenyl benzamide-type histone deacetylase inhibitors with enhanced potency and selectivity. J Med Chem50:5543-6 (2007) 
 
Histone deacetylase 1
Name:Histone deacetylase 1
Type:Enzyme
Mol. Mass.:55090.27
Organism:Homo sapiens (Human)
Description:Q13547
Residue:482
BDBM19421
BDBM19411
NameBDBM19421
Synonyms:4-{[(3,4-dimethoxyphenyl)amino]methyl}-N-[2-hydroxy-5-(thiophen-2-yl)phenyl]benzamide | benzamide-type inhibitor, 17
TypeSmall organic molecule
Emp. Form.C26H24N2O4S
Mol. Mass.460.545
SMILESCOc1ccc(NCc2ccc(cc2)C(=O)Nc2cc(ccc2O)-c2cccs2)cc1OC