Reaction Details
TargetHistone deacetylase 2
LigandBDBM19414
Substrate/CompetitorBDBM19411
Meas. Tech.HDAC Enzyme Activity Assay
pH8±n/a
Temperature310.15±n/a K
IC50 80±n/a nM
Citation Moradei, OMMallais, TCFrechette, SPaquin, ITessier, PELeit, SMFournel, MBonfils, CTrachy-Bourget, MCLiu, JYan, TPLu, AHRahil, JWang, JLefebvre, SLi, ZVaisburg, AFBesterman, JM Novel aminophenyl benzamide-type histone deacetylase inhibitors with enhanced potency and selectivity. J Med Chem50:5543-6 (2007) 
 
Histone deacetylase 2
Name:Histone deacetylase 2
Type:Chromatin regulator; hydrolase; repressor
Mol. Mass.:55356.54
Organism:Homo sapiens (Human)
Description:Q92769
Residue:488
BDBM19414
BDBM19411
NameBDBM19414
Synonyms:N-[2-amino-5-(thiophen-2-yl)phenyl]-4-{[(3,4-dimethoxyphenyl)amino]methyl}benzamide | benzamide-type inhibitor, 10
TypeSmall organic molecule
Emp. Form.C26H25N3O3S
Mol. Mass.459.56
SMILESCOc1ccc(NCc2ccc(cc2)C(=O)Nc2cc(ccc2N)-c2cccs2)cc1OC