Reaction Details
TargetHistone deacetylase 8
LigandBDBM19423
Substrate/CompetitorBDBM19411
Meas. Tech.HDAC Enzyme Activity Assay
IC50>20000±n/a nM
Citation Moradei, OMMallais, TCFrechette, SPaquin, ITessier, PELeit, SMFournel, MBonfils, CTrachy-Bourget, MCLiu, JYan, TPLu, AHRahil, JWang, JLefebvre, SLi, ZVaisburg, AFBesterman, JM Novel aminophenyl benzamide-type histone deacetylase inhibitors with enhanced potency and selectivity. J Med Chem50:5543-6 (2007) 
 
Histone deacetylase 8
Name:Histone deacetylase 8
Type:Enzyme
Mol. Mass.:41749.60
Organism:Homo sapiens (Human)
Description:Q9BY41
Residue:377
BDBM19423
BDBM19411
NameBDBM19423
Synonyms:HDAC inhibitor, Compound 1 N-[2-amino-5-(thiophen-2-yl)phenyl]-4-acetamidobenzamide (60) benzamide-type inhibitor, 19
TypeSmall organic molecule
Emp. Form.C19H17N3O2S
Mol. Mass.351.422
SMILESCC(=O)Nc1ccc(cc1)C(=O)Nc1cc(ccc1N)-c1cccs1