Reaction Details
TargetHistone deacetylase 1
LigandBDBM19426
Substrate/CompetitorBDBM19411
Meas. Tech.HDAC Enzyme Activity Assay
IC50 2000±n/a nM
Citation Moradei, OMMallais, TCFrechette, SPaquin, ITessier, PELeit, SMFournel, MBonfils, CTrachy-Bourget, MCLiu, JYan, TPLu, AHRahil, JWang, JLefebvre, SLi, ZVaisburg, AFBesterman, JM Novel aminophenyl benzamide-type histone deacetylase inhibitors with enhanced potency and selectivity. J Med Chem50:5543-6 (2007) 
 
Histone deacetylase 1
Name:Histone deacetylase 1
Type:Enzyme
Mol. Mass.:55090.27
Organism:Homo sapiens (Human)
Description:Q13547
Residue:482
BDBM19426
BDBM19411
NameBDBM19426
Synonyms:N-(2-aminophenyl)-4-methoxybenzamide | benzamide-type inhibitor, 22
TypeSmall organic molecule
Emp. Form.C14H14N2O2
Mol. Mass.242.2732
SMILESCOc1ccc(cc1)C(=O)Nc1ccccc1N