Reaction Details
TargetTransient receptor potential cation channel subfamily A member 1
LigandBDBM361758
Substrate/Competitorn/a
Meas. Tech.Measuring Inhibition of the TRPA1 Ion Channel
IC50 1.000±n/a nM
Citation Chenard, BLWu, X Inhibiting the transient receptor potential A1 ion channel US Patent US10221177 Publication Date 3/5/2019
 
Transient receptor potential cation channel subfamily A member 1
Name:Transient receptor potential cation channel subfamily A member 1
Type:Protein
Mol. Mass.:127514.20
Organism:Homo sapiens (Human)
Description:O75762
Residue:1119
BDBM361758
NameBDBM361758
Synonyms:US10221177, Compound 121
TypeSmall organic molecule
Emp. Form.C26H23F3N8O5
Mol. Mass.584.5066
SMILESCOc1ncc(cc1C(F)(F)F)-c1cccc(NC(=O)[C@H](C)n2cnc3n(C)c(=O)n(Cc4cc(C)on4)c(=O)c23)n1