Reaction Details
TargetEstrogen receptor beta
LigandBDBM19447
Substrate/Competitor17beta-estradiol (E2)
Meas. Tech.Estrogen Receptor Binding Assay.
pH7.5±n/a
Temperature295.15±n/a K
IC50 1800±100 nM
CommentsRelative Binding Affinity (RBA) =0.009 +/- 0.005.
Citation Qin, ZKastrati, IChandrasena, RELiu, HYao, PPetukhov, PABolton, JLThatcher, GR Benzothiophene selective estrogen receptor modulators with modulated oxidative activity and receptor affinity. J Med Chem50:2682-92 (2007) 
 
Estrogen receptor beta
Name:Estrogen receptor beta
Type:Protein
Mol. Mass.:59238.43
Organism:Homo sapiens (Human)
Description:Q92731
Residue:530
BDBM19447
17beta-estradiol (E2)
NameBDBM19447
Synonyms:2-(4-methanesulfonylphenyl)-3-{4-[2-(piperidin-1-yl)ethoxy]phenoxy}-1-benzothiophen-6-ol CHEMBL389907
TypeSmall organic molecule
Emp. Form.C28H29NO5S2
Mol. Mass.523.664
SMILESCS(=O)(=O)c1ccc(cc1)-c1sc2cc(O)ccc2c1Oc1ccc(OCCN2CCCCC2)cc1