Reaction Details
TargetEstrogen receptor
LigandBDBM19451
Substrate/Competitor17beta-estradiol (E2)
Meas. Tech.Estrogen Receptor Binding Assay.
pH7.5±n/a
Temperature273.15±n/a K
Ki 3333±n/a nM
CommentsRBA=0.006 +/- 0.002 %
Citation Zhou, HBSheng, SCompton, DRKim, YJoachimiak, ASharma, SCarlson, KEKatzenellenbogen, BSNettles, KWGreene, GLKatzenellenbogen, JA Structure-guided optimization of estrogen receptor binding affinity and antagonist potency of pyrazolopyrimidines with basic side chains. J Med Chem50:399-403 (2007) 
 
Estrogen receptor
Name:Estrogen receptor
Type:Protein
Mol. Mass.:66230.44
Organism:Homo sapiens (Human)
Description:P03372
Residue:595
BDBM19451
17beta-estradiol (E2)
NameBDBM19451
Synonyms:2,3-bis(4-hydroxyphenyl)pyrazolo[1,5-a]pyrimidin-6-ol | Pyrazolo[1,5-a]pyrimidine, 1
TypeSmall organic molecule
Emp. Form.C18H13N3O3
Mol. Mass.319.3141
SMILESOc1ccc(cc1)-c1nn2cc(O)cnc2c1-c1ccc(O)cc1