Reaction Details
TargetEstrogen receptor
LigandBDBM19453
Substrate/Competitor17beta-estradiol (E2)
Meas. Tech.Estrogen Receptor Binding Assay.
pH7.5±n/a
Temperature273.15±n/a K
Ki 51±n/a nM
CommentsRBA=0.39 +/- 0.003 %
Citation Zhou, HBSheng, SCompton, DRKim, YJoachimiak, ASharma, SCarlson, KEKatzenellenbogen, BSNettles, KWGreene, GLKatzenellenbogen, JA Structure-guided optimization of estrogen receptor binding affinity and antagonist potency of pyrazolopyrimidines with basic side chains. J Med Chem50:399-403 (2007) 
 
Estrogen receptor
Name:Estrogen receptor
Type:Protein
Mol. Mass.:66230.44
Organism:Homo sapiens (Human)
Description:P03372
Residue:595
BDBM19453
17beta-estradiol (E2)
NameBDBM19453
Synonyms:4-[3-phenyl-5,7-bis(trifluoromethyl)pyrazolo[1,5-a]pyrimidin-2-yl]phenol | Pyrazolo[1,5-a]pyrimidine, 2b
TypeSmall organic molecule
Emp. Form.C20H11F6N3O
Mol. Mass.423.3113
SMILESOc1ccc(cc1)-c1nn2c(cc(nc2c1-c1ccccc1)C(F)(F)F)C(F)(F)F