Reaction Details
TargetEstrogen receptor beta
LigandBDBM19454
Substrate/Competitor17beta-estradiol (E2)
Meas. Tech.Estrogen Receptor Binding and Transcription Activation Assay
pH7.5±n/a
Temperature273.15±n/a K
Ki 48±n/a nM
EC50 600±n/a nM
CommentsRBA=1.04 +/- 0.09 %. EC50/IC50 was measured from the antagonist profile.
Citation Zhou, HBSheng, SCompton, DRKim, YJoachimiak, ASharma, SCarlson, KEKatzenellenbogen, BSNettles, KWGreene, GLKatzenellenbogen, JA Structure-guided optimization of estrogen receptor binding affinity and antagonist potency of pyrazolopyrimidines with basic side chains. J Med Chem50:399-403 (2007) 
 
Estrogen receptor beta
Name:Estrogen receptor beta
Type:Protein
Mol. Mass.:59238.43
Organism:Homo sapiens (Human)
Description:Q92731
Residue:530
BDBM19454
17beta-estradiol (E2)
NameBDBM19454
Synonyms:4-[2-(4-hydroxyphenyl)-5,7-bis(trifluoromethyl)pyrazolo[1,5-a]pyrimidin-3-yl]phenol | Pyrazolo[1,5-a]pyrimidine, 3
TypeSmall organic molecule
Emp. Form.C20H11F6N3O2
Mol. Mass.439.3107
SMILESOc1ccc(cc1)-c1nn2c(cc(nc2c1-c1ccc(O)cc1)C(F)(F)F)C(F)(F)F