Reaction Details
TargetEstrogen receptor beta
LigandBDBM19458
Substrate/Competitor17beta-estradiol (E2)
Meas. Tech.Estrogen Receptor Binding Assay.
pH7.5±n/a
Temperature273.15±n/a K
Ki 156±n/a nM
CommentsRBA=0.32 +/- 0.04 %
Citation Zhou, HBSheng, SCompton, DRKim, YJoachimiak, ASharma, SCarlson, KEKatzenellenbogen, BSNettles, KWGreene, GLKatzenellenbogen, JA Structure-guided optimization of estrogen receptor binding affinity and antagonist potency of pyrazolopyrimidines with basic side chains. J Med Chem50:399-403 (2007) 
 
Estrogen receptor beta
Name:Estrogen receptor beta
Type:Protein
Mol. Mass.:59238.43
Organism:Homo sapiens (Human)
Description:Q92731
Residue:530
BDBM19458
17beta-estradiol (E2)
NameBDBM19458
Synonyms:4-(2-{4-[2-(dimethylamino)ethoxy]phenyl}-5,7-bis(trifluoromethyl)pyrazolo[1,5-a]pyrimidin-3-yl)phenol | Pyrazolo[1,5-a]pyrimidine, 12d
TypeSmall organic molecule
Emp. Form.C24H20F6N4O2
Mol. Mass.510.4316
SMILESCN(C)CCOc1ccc(cc1)-c1nn2c(cc(nc2c1-c1ccc(O)cc1)C(F)(F)F)C(F)(F)F