Reaction Details
TargetEstrogen receptor
LigandBDBM19459
Substrate/Competitor17beta-estradiol (E2)
Meas. Tech.Competition-Based Ligand Binding Assay.
pH7.6±n/a
Temperature295.15±n/a K
IC50 1145±368 nM
Citation Roelens, FHeldring, NDhooge, WBengtsson, MComhaire, FGustafsson, JATreuter, EDe Keukeleire, D Subtle side-chain modifications of the hop phytoestrogen 8-prenylnaringenin result in distinct agonist/antagonist activity profiles for estrogen receptors alpha and beta. J Med Chem49:7357-65 (2006) 
 
Estrogen receptor
Name:Estrogen receptor
Type:Protein
Mol. Mass.:66230.44
Organism:Homo sapiens (Human)
Description:P03372
Residue:595
BDBM19459
17beta-estradiol (E2)
NameBDBM19459
Synonyms:5,7-dihydroxy-3-(4-hydroxyphenyl)-4H-chromen-4-one Genistein Genisteol US8552057, 2 | cid_5280961
TypePhytoestrogen
Emp. Form.C15H10O5
Mol. Mass.270.2369
SMILESOc1ccc(cc1)-c1coc2cc(O)cc(O)c2c1=O