Reaction Details
TargetEstrogen receptor
LigandBDBM19461
Substrate/Competitor17beta-estradiol (E2)
Meas. Tech.Competition-Based Ligand Binding Assay.
pH7.6±n/a
Temperature295.15±n/a K
IC50 72302±17790 nM
Citation Roelens, FHeldring, NDhooge, WBengtsson, MComhaire, FGustafsson, JATreuter, EDe Keukeleire, D Subtle side-chain modifications of the hop phytoestrogen 8-prenylnaringenin result in distinct agonist/antagonist activity profiles for estrogen receptors alpha and beta. J Med Chem49:7357-65 (2006) 
 
Estrogen receptor
Name:Estrogen receptor
Type:Protein
Mol. Mass.:66230.44
Organism:Homo sapiens (Human)
Description:P03372
Residue:595
BDBM19461
17beta-estradiol (E2)
NameBDBM19461
Synonyms:α-CA inhibitor, 5 CHEMBL32571 Naringenin (NAR) salipurpol
TypeEstrgen Antagonist
Emp. Form.C15H12O5
Mol. Mass.272.2528
SMILESOc1ccc(cc1)C1CC(=O)c2c(O)cc(O)cc2O1