Reaction Details
TargetEstrogen receptor beta
LigandBDBM17292
Substrate/Competitor17beta-estradiol (E2)
Meas. Tech.Competition-Based Ligand Binding Assay.
pH7.6±n/a
Temperature295.15±n/a K
IC50 1.4±0.6 nM
Citation Roelens, FHeldring, NDhooge, WBengtsson, MComhaire, FGustafsson, JATreuter, EDe Keukeleire, D Subtle side-chain modifications of the hop phytoestrogen 8-prenylnaringenin result in distinct agonist/antagonist activity profiles for estrogen receptors alpha and beta. J Med Chem49:7357-65 (2006) 
 
Estrogen receptor beta
Name:Estrogen receptor beta
Type:Protein
Mol. Mass.:59238.43
Organism:Homo sapiens (Human)
Description:Q92731
Residue:530
BDBM17292
17beta-estradiol (E2)
NameBDBM17292
Synonyms:(1S,10R,11S,14S,15S)-15-methyltetracyclo[8.7.0.0^{2,7}.0^{11,15}]heptadeca-2,4,6-triene-5,14-diol 17α-ethinylestradiol CHEMBL135 ESTRADIOL Ovocyclin US9040509, E2 US9561238, E2 [2,4,6,7-3H]-E2 [3H]]estradiol
TypeSteroid
Emp. Form.C18H24O2
Mol. Mass.272.382
SMILES[H][C@@]12CC[C@H](O)[C@@]1(C)CC[C@]1([H])c3ccc(O)cc3CC[C@@]21[H]