Reaction Details
TargetCathepsin S
LigandBDBM19505
Substrate/CompetitorBDBM19490
Meas. Tech.Enzyme Inhibition Assay
pH6.5±n/a
Temperature295.15±n/a K
IC50 0.3±n/a nM
Citation Gauthier, JYBlack, WCCourchesne, ICromlish, WDesmarais, SHoule, RLamontagne, SLi, CSMassé, FMcKay, DJOuellet, MRobichaud, JTruchon, JFTruong, VLWang, QPercival, MD The identification of potent, selective, and bioavailable cathepsin S inhibitors. Bioorg Med Chem Lett17:4929-33 (2007) 
 
Cathepsin S
Name:Cathepsin S
Type:Protein
Mol. Mass.:37507.38
Organism:Homo sapiens (Human)
Description:P25774
Residue:331
BDBM19505
BDBM19490
NameBDBM19505
Synonyms:(2R)-N-(1-cyanocyclopropyl)-3-{[(2,3-difluorophenyl)methane]sulfonyl}-2-{[(1S)-2,2,2-trifluoro-1-(4-fluorophenyl)ethyl]amino}propanamide | trifluoroethylamine inhibitor, 15
TypeSmall organic molecule
Emp. Form.C22H19F6N3O3S
Mol. Mass.519.46
SMILESFc1ccc(cc1)[C@H](N[C@@H](CS(=O)(=O)Cc1cccc(F)c1F)C(=O)NC1(CC1)C#N)C(F)(F)F