Reaction Details
TargetCathepsin K
LigandBDBM19489
Substrate/CompetitorBDBM19480
Meas. Tech.Enzyme Inhibition Assay
IC50 0.2±n/a nM
Citation Gauthier, JYBlack, WCCourchesne, ICromlish, WDesmarais, SHoule, RLamontagne, SLi, CSMassé, FMcKay, DJOuellet, MRobichaud, JTruchon, JFTruong, VLWang, QPercival, MD The identification of potent, selective, and bioavailable cathepsin S inhibitors. Bioorg Med Chem Lett17:4929-33 (2007) 
 
Cathepsin K
Name:Cathepsin K
Type:Enzyme
Mol. Mass.:36879.51
Organism:Oryctolagus cuniculus (rabbit)
Description:n/a
Residue:329
BDBM19489
BDBM19480
NameBDBM19489
Synonyms:(2S)-N-(cyanomethyl)-4-methyl-2-[[(1S)-2,2,2-trifluoro-1-[4-(4-methylsulfon CHEMBL437501 | L-873724
TypeSmall organic molecule
Emp. Form.C23H26F3N3O3S
Mol. Mass.481.531
SMILESCC(C)C[C@H](N[C@@H](c1ccc(cc1)-c1ccc(cc1)S(C)(=O)=O)C(F)(F)F)C(=O)NCC#N