Reaction Details
TargetCathepsin K
LigandBDBM19518
Substrate/CompetitorBDBM19480
Meas. Tech.Enzyme Inhibition Assay
IC50<0.005±n/a nM
Citation Li, CSDeschenes, DDesmarais, SFalgueyret, JPGauthier, JYKimmel, DBLéger, SMassé, FMcGrath, MEMcKay, DJPercival, MDRiendeau, DRodan, SBThérien, MTruong, VLWesolowski, GZamboni, RBlack, WC Identification of a potent and selective non-basic cathepsin K inhibitor. Bioorg Med Chem Lett16:1985-9 (2006) 
 
Cathepsin K
Name:Cathepsin K
Type:Enzyme
Mol. Mass.:36879.51
Organism:Oryctolagus cuniculus (rabbit)
Description:n/a
Residue:329
BDBM19518
BDBM19480
NameBDBM19518
Synonyms:(2S)-N-(cyanomethyl)-4-methyl-2-{[(1S)-2,2,2-trifluoro-1-{4-[4-(piperazin-1-yl)phenyl]phenyl}ethyl]amino}pentanamide trifluoroethylamine analogue, 1
TypeSmall organic molecule
Emp. Form.C26H32F3N5O
Mol. Mass.487.5604
SMILESCC(C)C[C@H](N[C@@H](c1ccc(cc1)-c1ccc(cc1)N1CCNCC1)C(F)(F)F)C(=O)NCC#N