Reaction Details
TargetCathepsin K
LigandBDBM19523
Substrate/CompetitorBDBM19480
Meas. Tech.Enzyme Inhibition Assay
IC50 0.2±n/a nM
Citation Li, CSDeschenes, DDesmarais, SFalgueyret, JPGauthier, JYKimmel, DBLéger, SMassé, FMcGrath, MEMcKay, DJPercival, MDRiendeau, DRodan, SBThérien, MTruong, VLWesolowski, GZamboni, RBlack, WC Identification of a potent and selective non-basic cathepsin K inhibitor. Bioorg Med Chem Lett16:1985-9 (2006) 
 
Cathepsin K
Name:Cathepsin K
Type:Enzyme
Mol. Mass.:36879.51
Organism:Oryctolagus cuniculus (rabbit)
Description:n/a
Residue:329
BDBM19523
BDBM19480
NameBDBM19523
Synonyms:(2S)-N-(cyanomethyl)-4-methyl-2-{[(1S)-2,2,2-trifluoro-1-(4-phenylphenyl)ethyl]amino}pentanamide | trifluoroethylamine analogue, 12
TypeSmall organic molecule
Emp. Form.C22H24F3N3O
Mol. Mass.403.4407
SMILESCC(C)C[C@H](N[C@@H](c1ccc(cc1)-c1ccccc1)C(F)(F)F)C(=O)NCC#N