Reaction Details
TargetCathepsin K
LigandBDBM19538
Substrate/CompetitorBDBM19480
Meas. Tech.Enzyme Inhibition Assay
IC50 0.2±n/a nM
Citation Li, CSDeschenes, DDesmarais, SFalgueyret, JPGauthier, JYKimmel, DBLéger, SMassé, FMcGrath, MEMcKay, DJPercival, MDRiendeau, DRodan, SBThérien, MTruong, VLWesolowski, GZamboni, RBlack, WC Identification of a potent and selective non-basic cathepsin K inhibitor. Bioorg Med Chem Lett16:1985-9 (2006) 
 
Cathepsin K
Name:Cathepsin K
Type:Enzyme
Mol. Mass.:36879.51
Organism:Oryctolagus cuniculus (rabbit)
Description:n/a
Residue:329
BDBM19538
BDBM19480
NameBDBM19538
Synonyms:(2S)-N-(cyanomethyl)-4-methyl-2-{[(1S)-2,2,2-trifluoro-1-[4-(thiophen-3-yl)phenyl]ethyl]amino}pentanamide | trifluoroethylamine analogue, 28
TypeSmall organic molecule
Emp. Form.C20H22F3N3OS
Mol. Mass.409.468
SMILESCC(C)C[C@H](N[C@@H](c1ccc(cc1)-c1ccsc1)C(F)(F)F)C(=O)NCC#N