Reaction Details
TargetC-X-C chemokine receptor type 2
LigandBDBM362182
Substrate/Competitorn/a
Meas. Tech.FLIPR-3 Calcium Assay
IC50 14.0±3 nM
Citation Maeda, DYZebala, JA Pyridinecarboxamides as CXCR2 modulators US Patent US Patent
 
C-X-C chemokine receptor type 2
Name:C-X-C chemokine receptor type 2
Type:Protein
Mol. Mass.:40767.88
Organism:Homo sapiens (Human)
Description:P25025
Residue:360
BDBM362182
NameBDBM362182
Synonyms:USRE47267, Compound 137
TypeSmall organic molecule
Emp. Form.C20H16FN3O5S
Mol. Mass.429.422
SMILESCCOC(=O)c1cc(on1)C(=O)CSc1ccc(cn1)C(=O)Nc1ccc(F)cc1