Reaction Details
TargetC-X-C chemokine receptor type 2
LigandBDBM150811
Substrate/Competitorn/a
Meas. Tech.FLIPR-3 Calcium Assay
IC50 38.0±3 nM
Citation Maeda, DYZebala, JA Pyridinecarboxamides as CXCR2 modulators US Patent US Patent
 
C-X-C chemokine receptor type 2
Name:C-X-C chemokine receptor type 2
Type:Protein
Mol. Mass.:40767.88
Organism:Homo sapiens (Human)
Description:P25025
Residue:360
BDBM150811
NameBDBM150811
Synonyms:US8981106, 1 (SX-517) | USRE47267, Compound 1
TypeSmall organic molecule
Emp. Form.C19H16BFN2O3S
Mol. Mass.382.216
SMILESOB(O)c1ccccc1CSc1ccc(cn1)C(=O)Nc1ccc(F)cc1