Reaction Details
TargetCalcitonin gene-related peptide type 1 receptor
LigandBDBM361594
Substrate/Competitorn/a
Meas. Tech.Receptor Functional Assay
Ki 0.067±n/a nM
Citation Bell, IMFraley, MEGallicchio, SNGinnetti, AMitchell, HJPaone, DVStaas, DDWang, CZartman, CB Piperidinone carboxamide azaindane CGRP receptor antagonists US Patent US9833448 Publication Date 12/5/2017
 
Calcitonin gene-related peptide type 1 receptor
Name:Calcitonin gene-related peptide type 1 receptor
Type:Enzyme Catalytic Domain
Mol. Mass.:52980.45
Organism:Homo sapiens (Human)
Description:Q16602
Residue:461
BDBM361594
NameBDBM361594
Synonyms:US10272077, Example 1 | US9833448, Example 1
TypeSmall organic molecule
Emp. Form.C29H26F3N5O3
Mol. Mass.549.5436
SMILESC[C@@H]1[C@@H](C[C@H](NC(=O)c2cnc3C[C@]4(Cc3c2)C(=O)Nc2ncccc42)C(=O)N1CC(F)(F)F)c1ccccc1