Reaction Details
TargetCalcitonin gene-related peptide type 1 receptor
LigandBDBM362174
Substrate/Competitorn/a
Meas. Tech.Receptor Functional Assay
Ki 0.055±n/a nM
Citation Bell, IMFraley, MEGallicchio, SNGinnetti, AMitchell, HJPaone, DVStaas, DDWang, CZartman, CB Piperidinone carboxamide azaindane CGRP receptor antagonists US Patent US9833448 Publication Date 12/5/2017
 
Calcitonin gene-related peptide type 1 receptor
Name:Calcitonin gene-related peptide type 1 receptor
Type:Enzyme Catalytic Domain
Mol. Mass.:52980.45
Organism:Homo sapiens (Human)
Description:Q16602
Residue:461
BDBM362174
NameBDBM362174
Synonyms:US9833448, Example 17
TypeSmall organic molecule
Emp. Form.C31H29F2N5O3
Mol. Mass.557.5905
SMILESFc1cccc([C@@H]2C[C@H](NC(=O)c3cnc4C[C@]5(Cc4c3)C(=O)Nc3ncccc53)C(=O)N(CC3CCC3)C2)c1F