Reaction Details
TargetCalcitonin gene-related peptide type 1 receptor
LigandBDBM362176
Substrate/Competitorn/a
Meas. Tech.Receptor Functional Assay
Ki 0.140±n/a nM
Citation Bell, IMFraley, MEGallicchio, SNGinnetti, AMitchell, HJPaone, DVStaas, DDWang, CZartman, CB Piperidinone carboxamide azaindane CGRP receptor antagonists US Patent US9833448 Publication Date 12/5/2017
 
Calcitonin gene-related peptide type 1 receptor
Name:Calcitonin gene-related peptide type 1 receptor
Type:Enzyme Catalytic Domain
Mol. Mass.:52980.45
Organism:Homo sapiens (Human)
Description:Q16602
Residue:461
BDBM362176
NameBDBM362176
Synonyms:US10272077, Example 30 | US9833448, Example 30
TypeSmall organic molecule
Emp. Form.C30H25F3N6O3
Mol. Mass.574.5531
SMILESC[C@@H]1[C@@H](C[C@H](NC(=O)c2cnc3C[C@]4(Cc3c2)C(=O)Nc2ncc(cc42)C#N)C(=O)N1CC(F)(F)F)c1ccccc1