Reaction Details
TargetCalcitonin gene-related peptide type 1 receptor
LigandBDBM362178
Substrate/Competitorn/a
Meas. Tech.Receptor Functional Assay
Ki 7.40±n/a nM
Citation Bell, IMFraley, MEGallicchio, SNGinnetti, AMitchell, HJPaone, DVStaas, DDWang, CZartman, CB Piperidinone carboxamide azaindane CGRP receptor antagonists US Patent US9833448 Publication Date 12/5/2017
 
Calcitonin gene-related peptide type 1 receptor
Name:Calcitonin gene-related peptide type 1 receptor
Type:Enzyme Catalytic Domain
Mol. Mass.:52980.45
Organism:Homo sapiens (Human)
Description:Q16602
Residue:461
BDBM362178
NameBDBM362178
Synonyms:US10272077, Example 8 from U.S. Pat. No. 7,390,798 | US9833448, Example 8 from U.S. Pat. No. 7,390,798
TypeSmall organic molecule
Emp. Form.C29H26F2N4O3
Mol. Mass.516.5385
SMILESCN1C[C@@H](CC[C@@H](NC(=O)c2ccc3CC4(Cc3c2)C(=O)Nc2ncccc42)C1=O)c1cccc(F)c1F