Reaction Details
TargetCalcitonin gene-related peptide type 1 receptor
LigandBDBM362181
Substrate/Competitorn/a
Meas. Tech.Receptor Functional Assay
Ki 4.30±n/a nM
Citation Bell, IMFraley, MEGallicchio, SNGinnetti, AMitchell, HJPaone, DVStaas, DDWang, CZartman, CB Piperidinone carboxamide azaindane CGRP receptor antagonists US Patent US9833448 Publication Date 12/5/2017
 
Calcitonin gene-related peptide type 1 receptor
Name:Calcitonin gene-related peptide type 1 receptor
Type:Enzyme Catalytic Domain
Mol. Mass.:52980.45
Organism:Homo sapiens (Human)
Description:Q16602
Residue:461
BDBM362181
NameBDBM362181
Synonyms:US10272077, Example 32 from U.S. Pat. No. 7,390,798 | US9833448, Example 8 from US 2010/0179166
TypeSmall organic molecule
Emp. Form.C32H30F2N6O3
Mol. Mass.584.6158
SMILESCC(C)(O)c1cnc2[C@@H](CC[C@H](Cn12)c1cccc(F)c1F)NC(=O)c1cc2CC3(Cc2cn1)C(=O)Nc1ncccc31