Reaction Details
TargetCathepsin S
LigandBDBM19554
Substrate/CompetitorBDBM19546
Meas. Tech.Enzyme Inhibition Assay
pH5.5±n/a
Temperature310.15±n/a K
Ki 33±n/a nM
Citation Liu, HTully, DCEpple, RBursulaya, BLi, JHarris, JLWilliams, JARusso, RTumanut, CRoberts, MJAlper, PBHe, YKaranewsky, DS Design and synthesis of arylaminoethyl amides as noncovalent inhibitors of cathepsin S. Part 1. Bioorg Med Chem Lett15:4979-84 (2005) 
 
Cathepsin S
Name:Cathepsin S
Type:Protein
Mol. Mass.:37507.38
Organism:Homo sapiens (Human)
Description:P25774
Residue:331
BDBM19554
BDBM19546
NameBDBM19554
Synonyms:(2S)-3-(3-chlorophenyl)-N-{2-[(4-methoxyphenyl)amino]ethyl}-2-[(3-methylphenyl)formamido]propanamide | arylaminoethyl amide, 5h
TypeSmall organic molecule
Emp. Form.C26H28ClN3O3
Mol. Mass.465.972
SMILESCOc1ccc(NCCNC(=O)[C@H](Cc2cccc(Cl)c2)NC(=O)c2cccc(C)c2)cc1