Reaction Details
TargetCathepsin S
LigandBDBM19576
Substrate/CompetitorBDBM19546
Meas. Tech.Enzyme Inhibition Assay
Ki 26±n/a nM
Citation Liu, HTully, DCEpple, RBursulaya, BLi, JHarris, JLWilliams, JARusso, RTumanut, CRoberts, MJAlper, PBHe, YKaranewsky, DS Design and synthesis of arylaminoethyl amides as noncovalent inhibitors of cathepsin S. Part 1. Bioorg Med Chem Lett15:4979-84 (2005) 
 
Cathepsin S
Name:Cathepsin S
Type:Protein
Mol. Mass.:37507.38
Organism:Homo sapiens (Human)
Description:P25774
Residue:331
BDBM19576
BDBM19546
NameBDBM19576
Synonyms:(2S)-3-cyclohexyl-N-{2-[(4-methoxyphenyl)amino]ethyl}-2-{[4-(1H-1,2,4-triazol-1-yl)phenyl]formamido}propanamide | arylaminoethyl amide, 14
TypeSmall organic molecule
Emp. Form.C27H34N6O3
Mol. Mass.490.5973
SMILESCOc1ccc(NCCNC(=O)[C@H](CC2CCCCC2)NC(=O)c2ccc(cc2)-n2cncn2)cc1