Reaction Details
TargetProcathepsin L
LigandBDBM19548
Substrate/CompetitorBDBM19584
Meas. Tech.Enzyme Inhibition Assay
Ki 22±n/a nM
Citation Liu, HTully, DCEpple, RBursulaya, BLi, JHarris, JLWilliams, JARusso, RTumanut, CRoberts, MJAlper, PBHe, YKaranewsky, DS Design and synthesis of arylaminoethyl amides as noncovalent inhibitors of cathepsin S. Part 1. Bioorg Med Chem Lett15:4979-84 (2005) 
 
Procathepsin L
Name:Procathepsin L
Type:Enzyme
Mol. Mass.:37557.19
Organism:Homo sapiens (Human)
Description:Purchased from Calbiochem (San Diego, CA).
Residue:333
BDBM19548
BDBM19584
NameBDBM19548
Synonyms:(2S)-2-cyclohexyl-N-{2-[(4-methoxyphenyl)amino]ethyl}-2-[(3-methylphenyl)formamido]acetamide | arylaminoethyl amide, 5b
TypeSmall organic molecule
Emp. Form.C25H33N3O3
Mol. Mass.423.5478
SMILESCOc1ccc(NCCNC(=O)[C@@H](NC(=O)c2cccc(C)c2)C2CCCCC2)cc1