Reaction Details
TargetProcathepsin L
LigandBDBM19556
Substrate/CompetitorBDBM19584
Meas. Tech.Enzyme Inhibition Assay
Ki 3.4±n/a nM
Citation Liu, HTully, DCEpple, RBursulaya, BLi, JHarris, JLWilliams, JARusso, RTumanut, CRoberts, MJAlper, PBHe, YKaranewsky, DS Design and synthesis of arylaminoethyl amides as noncovalent inhibitors of cathepsin S. Part 1. Bioorg Med Chem Lett15:4979-84 (2005) 
 
Procathepsin L
Name:Procathepsin L
Type:Enzyme
Mol. Mass.:37557.19
Organism:Homo sapiens (Human)
Description:Purchased from Calbiochem (San Diego, CA).
Residue:333
BDBM19556
BDBM19584
NameBDBM19556
Synonyms:(2S)-N-{2-[(4-methoxyphenyl)amino]ethyl}-3-(4-methylphenyl)-2-[(3-methylphenyl)formamido]propanamide | arylaminoethyl amide, 5j
TypeSmall organic molecule
Emp. Form.C27H31N3O3
Mol. Mass.445.5533
SMILESCOc1ccc(NCCNC(=O)[C@H](Cc2ccc(C)cc2)NC(=O)c2cccc(C)c2)cc1