Reaction Details
TargetCathepsin S
LigandBDBM19598
Substrate/CompetitorBDBM19546
Meas. Tech.Enzyme Inhibition Assay
pH5.5±n/a
Temperature310.15±n/a K
Ki 23±n/a nM
Citation Alper, PBLiu, HChatterjee, AKNguyen, KTTully, DCTumanut, CLi, JHarris, JLTuntland, TChang, JGordon, PHollenbeck, TKaranewsky, DS Arylaminoethyl amides as noncovalent inhibitors of cathepsin S. Part 2: Optimization of P1 and N-aryl. Bioorg Med Chem Lett16:1486-90 (2006) 
 
Cathepsin S
Name:Cathepsin S
Type:Protein
Mol. Mass.:37507.38
Organism:Homo sapiens (Human)
Description:P25774
Residue:331
BDBM19598
BDBM19546
NameBDBM19598
Synonyms:(2S)-N-[(2R)-1-(benzyloxy)-3-(5-fluoro-2,3-dihydro-1H-indol-1-yl)propan-2-yl]-4-cyclohexyl-2-[(3-methoxyphenyl)formamido]butanamide | arylaminoethyl amide, 8f
TypeSmall organic molecule
Emp. Form.C36H44FN3O4
Mol. Mass.601.7507
SMILESCOc1cccc(c1)C(=O)N[C@@H](CCC1CCCCC1)C(=O)N[C@@H](COCc1ccccc1)CN1CCc2cc(F)ccc12