Reaction Details
TargetProcathepsin L
LigandBDBM19606
Substrate/CompetitorBDBM19584
Meas. Tech.Enzyme Inhibition Assay
Ki 5±n/a nM
Citation Alper, PBLiu, HChatterjee, AKNguyen, KTTully, DCTumanut, CLi, JHarris, JLTuntland, TChang, JGordon, PHollenbeck, TKaranewsky, DS Arylaminoethyl amides as noncovalent inhibitors of cathepsin S. Part 2: Optimization of P1 and N-aryl. Bioorg Med Chem Lett16:1486-90 (2006) 
 
Procathepsin L
Name:Procathepsin L
Type:Enzyme
Mol. Mass.:37557.19
Organism:Homo sapiens (Human)
Description:Purchased from Calbiochem (San Diego, CA).
Residue:333
BDBM19606
BDBM19584
NameBDBM19606
Synonyms:(2S)-4-cyclohexyl-N-[(2S)-1-(5-fluoro-2,3-dihydro-1H-indol-1-yl)-4-(morpholin-4-yl)butan-2-yl]-2-[(3-methoxyphenyl)formamido]butanamide | arylaminoethyl amide, 8n
TypeSmall organic molecule
Emp. Form.C34H47FN4O4
Mol. Mass.594.7598
SMILESCOc1cccc(c1)C(=O)N[C@@H](CCC1CCCCC1)C(=O)N[C@@H](CCN1CCOCC1)CN1CCc2cc(F)ccc12