Reaction Details
TargetTyrosine-protein kinase BTK
LigandBDBM362375
Substrate/Competitorn/a
Meas. Tech.Enzyme Activity Assay
IC50 1.20±n/a nM
Citation Liu, JKim, RMKozlowski, JGuiadeen, DKrikorian, ADYu, Y BTK inhibitors US Patent US9834554 Publication Date 12/5/2017
 
Tyrosine-protein kinase BTK
Name:Tyrosine-protein kinase BTK
Type:Enzyme
Mol. Mass.:76289.95
Organism:Homo sapiens (Human)
Description:Q06187
Residue:659
BDBM362375
NameBDBM362375
Synonyms:4-{7-amino-3-[(3R)-1-(2- methylpropanoyl)piperidin-3-yl]- 1H-pyrazolo[3,4-c]pyridin-1-yl}- N-[4-(trifluoromethyl)pyridin- 2-yl]benzamide | US9834554, Example 19
TypeSmall organic molecule
Emp. Form.C28H28F3N7O2
Mol. Mass.551.5628
SMILESCC(C)C(=O)N1CCC[C@H](C1)c1nn(-c2ccc(cc2)C(=O)Nc2cc(ccn2)C(F)(F)F)c2c(N)nccc12