Reaction Details
TargetTyrosine-protein kinase BTK
LigandBDBM362391
Substrate/Competitorn/a
Meas. Tech.Enzyme Activity Assay
IC50 0.530±n/a nM
Citation Liu, JKim, RMKozlowski, JGuiadeen, DKrikorian, ADYu, Y BTK inhibitors US Patent US9834554 Publication Date 12/5/2017
 
Tyrosine-protein kinase BTK
Name:Tyrosine-protein kinase BTK
Type:Enzyme
Mol. Mass.:76289.95
Organism:Homo sapiens (Human)
Description:Q06187
Residue:659
BDBM362391
NameBDBM362391
Synonyms:4-{3-[(3R)-l- acetylpiperidin-3-yl]-7- amino-1H-pyrazolo[3,4-c]pyridin-1-yl}- N-[4-(trifluoromethyl)pyridin- 2-yl]benzamide | US9834554, Example 21
TypeSmall organic molecule
Emp. Form.C26H24F3N7O2
Mol. Mass.523.5097
SMILESCC(=O)N1CCC[C@H](C1)c1nn(-c2ccc(cc2)C(=O)Nc2cc(ccn2)C(F)(F)F)c2c(N)nccc12